BDBM13343 N-[4-Chloro-3-(3-pyridinyloxymethyl)phenyl]benzamide::N-{4-chloro-3-[(pyridin-3-yloxy)methyl]phenyl}benzamide::Pyridine derived fragment based inhibitor 8
SMILES Clc1ccc(NC(=O)c2ccccc2)cc1COc1cccnc1
InChI Key InChIKey=DSAKUHYNCBIVKU-UHFFFAOYSA-N
Data  1 IC50
  Tab Delimited (TSV)   2D SDfile   Computed 3D by Vconf -m prep SDfile
Find this compound or compounds like it in BindingDB:
Activity Spreadsheet -- Enzyme Inhibition Constant Data from BindingDB
Found 1 hit for monomerid = 13343
TargetMitogen-activated protein kinase 14(Homo sapiens (Human))
Astex
LigandPNGBDBM13343(N-[4-Chloro-3-(3-pyridinyloxymethyl)phenyl]benzami...)
Affinity DataIC50:  3.00E+4nMpH: 7.4 T: 2°C. Assay description: IC50 is the inhibitor concentration, which inhibits 50% of kinase activity that catalyzes the transfer of the terminal phosphate from [gamma-33P] lab...
In DepthDetails ArticlePubMed