BDBM13350 3-fluoro-N-(1H-indol-5-yl)-5-(morpholin-4-yl)benzamide::3-fluoro-N-1H-indol-5-yl-5-morpholin-4-ylbenzamide::Indole derived fragment based inhibitor 22
SMILES Fc1cc(cc(c1)C(=O)Nc1ccc2[nH]ccc2c1)N1CCOCC1
InChI Key InChIKey=VMLSXFMXUNVCSK-UHFFFAOYSA-N
Data  1 IC50
PDB links: 1 PDB ID matches this monomer.
  Tab Delimited (TSV)   2D SDfile   Computed 3D by Vconf -m prep SDfile
Find this compound or compounds like it in BindingDB:
Activity Spreadsheet -- Enzyme Inhibition Constant Data from BindingDB
Found 1 hit for monomerid = 13350
TargetMitogen-activated protein kinase 14(Homo sapiens (Human))
Astex
LigandPNGBDBM13350(3-fluoro-N-(1H-indol-5-yl)-5-(morpholin-4-yl)benza...)
Affinity DataIC50:  1.62E+5nMpH: 7.4 T: 2°C. Assay description: IC50 is the inhibitor concentration, which inhibits 50% of kinase activity that catalyzes the transfer of the terminal phosphate from [gamma-33P] lab...