BDBM133853 US8846699, 173
SMILES CC(N)C(=O)NCCOc1cc2ncnc(Nc3ccc(Br)cc3F)c2cc1NC(=O)C=C
InChI Key InChIKey=PPYSXGBNOGMWKR-UHFFFAOYSA-N
Data  2 IC50
  Tab Delimited (TSV)   2D SDfile   Computed 3D by Vconf -m prep SDfile
Find this compound or compounds like it in BindingDB:
Activity Spreadsheet -- Enzyme Inhibition Constant Data from BindingDB
Found 2 hits for monomerid = 133853
TargetEpidermal growth factor receptor(Homo sapiens (Human))
Hanmi Pharm.
US Patent
LigandPNGBDBM133853(US8846699, 173)
Affinity DataIC50:  18nMpH: 7.4 T: 2°C. Assay description: EGFR1 (HER-1) enzyme assay was carried out by using Tyrosine Kinase Assay Kit Green. The entire assay was conducted in accordance with EGFR PTK inhib...
In DepthDetails US Patent
TargetVascular endothelial growth factor receptor 2(Homo sapiens (Human))
Hanmi Pharm.
US Patent
LigandPNGBDBM133853(US8846699, 173)
Affinity DataIC50:  165nMpH: 7.4 T: 2°C. Assay description: VEGFR2 (KDR, Proquinase) enzyme assay (auto-phosphorylation assay) was carried out by using Tyrosine Kinase Assay Kit Green (Panvera). The entire ass...
In DepthDetails US Patent