BDBM134232 US8846673, 128
SMILES COc1cccc(c1)-c1cnc(Nc2ccccc2)c2[nH]nc(N)c12
InChI Key InChIKey=QKNXFQUKBFUGCN-UHFFFAOYSA-N
Data  1 IC50
  Tab Delimited (TSV)   2D SDfile   Computed 3D by Vconf -m prep SDfile
Find this compound or compounds like it in BindingDB:
Activity Spreadsheet -- Enzyme Inhibition Constant Data from BindingDB
Found 1 hit for monomerid = 134232
TargetTyrosine-protein kinase BTK(Homo sapiens (Human))
Bristol-Myers Squibb
US Patent
LigandPNGBDBM134232(US8846673, 128)
Affinity DataIC50:  290nMpH: 7.4 T: 2°C. Assay description: To V-bottom 384-well plates were added test compounds, human recombinant Btk (1 nM, Invitrogen Corporation), fluoresceinated peptide (1.5 uM), ATP (2...
In DepthDetails US Patent