BDBM13426 (15S)-4-methoxy-15-methyl-5-(sulfamoyloxy)tetracyclo[8.7.0.0^{2,7}.0^{11,15}]heptadeca-2(7),3,5-trien-14-yl sulfamate::oestrogen deriv. 11
SMILES COc1cc2C3CC[C@]4(C)C(CCC4C3CCc2cc1OS(N)(=O)=O)OS(N)(=O)=O
InChI Key InChIKey=AQSNIXKAKUZPSI-VKYAZVNUSA-N
Data  2 IC50
PDB links: 1 PDB ID matches this monomer.
  Tab Delimited (TSV)   2D SDfile   Computed 3D by Vconf -m prep SDfile
Find this compound or compounds like it in BindingDB:
Activity Spreadsheet -- Enzyme Inhibition Constant Data from BindingDB
Found 2 hits for monomerid = 13426
TargetSteryl-sulfatase(Homo sapiens (Human))
St. Mary'S Hospital
LigandPNGBDBM13426((15S)-4-methoxy-15-methyl-5-(sulfamoyloxy)tetracyc...)
Affinity DataIC50:  39nM. Assay description: The extent of in vitro inhibition of sulfatase activities was assessed using intact monolayers of JEG-3 cells. Sulfatase activity was measured using ...
In DepthDetails ArticlePubMed
TargetCarbonic anhydrase 2(Homo sapiens (Human))
St. Mary'S Hospital
LigandPNGBDBM13426((15S)-4-methoxy-15-methyl-5-(sulfamoyloxy)tetracyc...)
Affinity DataIC50:  379nMpH: 7.8 T: 2°C. Assay description: The in vitro inhibition of carbonic anhydrase was assessed by a colorimetric assay. Carbonic anhydrase-catalysed hydrolysis of p-nitrophenyl acetate ...