BDBM134275 US8846660, 73
SMILES CC[C@@H](NC(=O)N1C\C(NCC(Cc2cc(Cl)ccc2OC)C1=O)=N\Oc1ccccc1)c1cccc(c1)C(O)=O
InChI Key InChIKey=WHRJFSQXYYUJCK-NRWPOFLRSA-N
Data  1 IC50
  Tab Delimited (TSV)   2D SDfile   Computed 3D by Vconf -m prep SDfile
Find this compound or compounds like it in BindingDB:
Activity Spreadsheet -- Enzyme Inhibition Constant Data from BindingDB
Found 1 hit for monomerid = 134275
TargetChymase(Homo sapiens (Human))
Daiichi Sankyo
US Patent
LigandPNGBDBM134275(US8846660, 73)
Affinity DataIC50:  30nMpH: 7.5 T: 2°C. Assay description: The inhibitory activity of the compounds of the present invention for recombinant human chymase was measured by the method of Pasztor et al. (Pasztor...
In DepthDetails US Patent