BDBM134281 US8846660, 113
SMILES CCC[C@@H](NC(=O)N1C\C(NCC(Cc2cc(Cl)ccc2F)C1=O)=N\OCC)c1ccc(C(O)=O)c(N)c1
InChI Key InChIKey=FSPYZEQTABRBRD-IVAFLUGOSA-N
Data  1 IC50
  Tab Delimited (TSV)   2D SDfile   Computed 3D by Vconf -m prep SDfile
Find this compound or compounds like it in BindingDB:
Activity Spreadsheet -- Enzyme Inhibition Constant Data from BindingDB
Found 1 hit for monomerid = 134281
TargetChymase(Homo sapiens (Human))
Daiichi Sankyo
US Patent
LigandPNGBDBM134281(US8846660, 113)
Affinity DataIC50:  40nMpH: 7.5 T: 2°C. Assay description: The inhibitory activity of the compounds of the present invention for recombinant human chymase was measured by the method of Pasztor et al. (Pasztor...
In DepthDetails US Patent