BDBM134468 US8846656, 16-O
SMILES Cc1cc(N2CCc3nc(nc(N4CCCC(C)(C)C4)c3C2)-c2c(C)cccc2C)n(C)n1
InChI Key InChIKey=MDDPAAWKBVOSME-UHFFFAOYSA-N
Data  1 IC50
  Tab Delimited (TSV)   2D SDfile   Computed 3D by Vconf -m prep SDfile
Find this compound or compounds like it in BindingDB:
Activity Spreadsheet -- Enzyme Inhibition Constant Data from BindingDB
Found 1 hit for monomerid = 134468
TargetC5a anaphylatoxin chemotactic receptor 1(Homo sapiens (Human))
Novartis
US Patent
LigandPNGBDBM134468(US8846656, 16-O)
Affinity DataIC50:  90nM. Assay description: Compounds were tested for their ability to inhibit C5a-mediated calcium mobilization using a stable cell line over expressing the human C5aR & the Ga...
In DepthDetails US Patent