BDBM134469 US8846656, 16-V
SMILES CC(C)c1cc(N2CCc3nc(nc(N4CCCC(O)C4)c3C2)-c2c(C)cccc2C)n(C)n1
InChI Key InChIKey=OYSIHXDDIDVBJK-UHFFFAOYSA-N
Data  1 IC50
  Tab Delimited (TSV)   2D SDfile   Computed 3D by Vconf -m prep SDfile
Find this compound or compounds like it in BindingDB:
Activity Spreadsheet -- Enzyme Inhibition Constant Data from BindingDB
Found 1 hit for monomerid = 134469
TargetC5a anaphylatoxin chemotactic receptor 1(Homo sapiens (Human))
Novartis
US Patent
LigandPNGBDBM134469(US8846656, 16-V)
Affinity DataIC50:  338nM. Assay description: Compounds were tested for their ability to inhibit C5a-mediated calcium mobilization using a stable cell line over expressing the human C5aR & the Ga...
In DepthDetails US Patent