BDBM134477 US8846656, 17-AI
SMILES CC(C)c1ccc(C)c(c1)N1CCc2nc(nc(N3CCC(O)C(C)(C)C3)c2C1)-c1cccc2[nH]cc(C)c12
InChI Key
Data  1 IC50
  Tab Delimited (TSV)   2D SDfile   Computed 3D by Vconf -m prep SDfile
Find this compound or compounds like it in BindingDB:
Activity Spreadsheet -- Enzyme Inhibition Constant Data from BindingDB
Found 1 hit for monomerid = 134477
TargetC5a anaphylatoxin chemotactic receptor 1(Homo sapiens (Human))
Novartis
US Patent
LigandPNGBDBM134477(US8846656, 17-AI)
Affinity DataIC50:  19nM. Assay description: Compounds were tested for their ability to inhibit C5a-mediated calcium mobilization using a stable cell line over expressing the human C5aR & the Ga...
In DepthDetails US Patent