BDBM134482 US8846656, 17-AQ
SMILES CO[C@H]1CCN(C[C@H]1C)c1nc(nc2CCN(Cc12)c1cc(ccc1C)C(C)C)-c1cccc2[nH]cc(C)c12
InChI Key
Data  1 IC50
  Tab Delimited (TSV)   2D SDfile   Computed 3D by Vconf -m prep SDfile
Find this compound or compounds like it in BindingDB:
Activity Spreadsheet -- Enzyme Inhibition Constant Data from BindingDB
Found 1 hit for monomerid = 134482
TargetC5a anaphylatoxin chemotactic receptor 1(Homo sapiens (Human))
Novartis
US Patent
LigandPNGBDBM134482(US8846656, 17-AQ)
Affinity DataIC50:  16nM. Assay description: Compounds were tested for their ability to inhibit C5a-mediated calcium mobilization using a stable cell line over expressing the human C5aR & the Ga...
In DepthDetails US Patent