BDBM134497 US8846656, 19-AC
SMILES CO[C@H]1CCN(CC1(C)C)c1nc(nc2CCN(Cc12)c1cc(ccc1C)C1(C)COC1)-c1c(ccc2[nH]ncc12)C(C)C
InChI Key
Data  1 IC50
  Tab Delimited (TSV)   2D SDfile   Computed 3D by Vconf -m prep SDfile
Find this compound or compounds like it in BindingDB:
Activity Spreadsheet -- Enzyme Inhibition Constant Data from BindingDB
Found 1 hit for monomerid = 134497
TargetC5a anaphylatoxin chemotactic receptor 1(Homo sapiens (Human))
Novartis
US Patent
LigandPNGBDBM134497(US8846656, 19-AC)
Affinity DataIC50:  4nM. Assay description: Compounds were tested for their ability to inhibit C5a-mediated calcium mobilization using a stable cell line over expressing the human C5aR & the Ga...
In DepthDetails US Patent