BDBM134599 US8846656, 70-J
SMILES C[C@@H]1COCCN1c1nc(nc2CCN(Cc12)c1c(Cl)c(nn1C)C1CC1)-c1c(C)ccc2[nH]nc(C)c12
InChI Key
Data  1 IC50
  Tab Delimited (TSV)   2D SDfile   Computed 3D by Vconf -m prep SDfile
Find this compound or compounds like it in BindingDB:
Activity Spreadsheet -- Enzyme Inhibition Constant Data from BindingDB
Found 1 hit for monomerid = 134599
TargetC5a anaphylatoxin chemotactic receptor 1(Homo sapiens (Human))
Novartis
US Patent
LigandPNGBDBM134599(US8846656, 70-J)
Affinity DataIC50:  12nM. Assay description: Compounds were tested for their ability to inhibit C5a-mediated calcium mobilization using a stable cell line over expressing the human C5aR & the Ga...
In DepthDetails US Patent