BDBM13461 N-[(3S)-3-(methylcarbamoyl)-2-{3-[3-(sulfoamino)phenyl]propanoyl}-1,2,3,4-tetrahydroisoquinolin-7-yl]sulfamic acid::Tetrahydroisoquinoline (TIQ) deriv. 10i
SMILES CNC(=O)[C@@H]1Cc2ccc(NS(O)(=O)=O)cc2CN1C(=O)CCc1cccc(NS(O)(=O)=O)c1
InChI Key InChIKey=VXWOHWHCMDFHJS-SFHVURJKSA-N
Data  4 IC50
PDB links: 1 PDB ID matches this monomer.
  Tab Delimited (TSV)   2D SDfile   Computed 3D by Vconf -m prep SDfile
Find this compound or compounds like it in BindingDB:
Activity Spreadsheet -- Enzyme Inhibition Constant Data from BindingDB
Found 4 hits for monomerid = 13461
TargetTyrosine-protein phosphatase non-receptor type 1 [1-298](Homo sapiens (Human))
Procter & Gamble Pharmaceuticals
LigandPNGBDBM13461(N-[(3S)-3-(methylcarbamoyl)-2-{3-[3-(sulfoamino)ph...)
Affinity DataIC50:  4.80E+3nM. Assay description: The activity of PTP1B enzyme was assayed with DiFMUP as substrate. Hydrolysis of substrate was monitored on a Victor V plate reader (Wallac). Kinetic...
TargetTyrosine-protein phosphatase non-receptor type 1(Homo sapiens (Human))
Shanghai Jiao Tong University
Curated by ChEMBL
LigandPNGBDBM13461(N-[(3S)-3-(methylcarbamoyl)-2-{3-[3-(sulfoamino)ph...)
Affinity DataIC50:  4.80E+3nM. Assay description: Inhibition of human recombinant PTP1B assessed as inhibition of hydrolysis of p-nitrophenol after 10 mins by spectrophotometry
TargetTyrosine-protein phosphatase non-receptor type 1(Homo sapiens (Human))
Shanghai Jiao Tong University
Curated by ChEMBL
LigandPNGBDBM13461(N-[(3S)-3-(methylcarbamoyl)-2-{3-[3-(sulfoamino)ph...)
Affinity DataIC50:  4.80E+3nM. Assay description: Inhibition of PTP1B
TargetTyrosine-protein phosphatase non-receptor type 2(Homo sapiens (Human))
Incyte
Curated by ChEMBL
LigandPNGBDBM13461(N-[(3S)-3-(methylcarbamoyl)-2-{3-[3-(sulfoamino)ph...)
Affinity DataIC50:  9.40E+3nM. Assay description: Inhibition of TCPTP
In DepthDetails ArticlePubMed