BDBM13511 Isothiazolidinone (IZD) deriv. 47::N-[(1S)-1-(1H-1,3-benzodiazol-2-yl)-2-[3-ethynyl-4-(1,1,3-trioxo-1,2-thiazolidin-5-yl)phenyl]ethyl]benzenesulfonamide
SMILES O=C1CC(c2ccc(C[C@H](NS(=O)(=O)c3ccccc3)c3nc4ccccc4[nH]3)cc2C#C)S(=O)(=O)N1
InChI Key InChIKey=TWAFNBHRHKRTOH-UXMRNZNESA-N
Data  1 IC50
  Tab Delimited (TSV)   2D SDfile   Computed 3D by Vconf -m prep SDfile
Find this compound or compounds like it in BindingDB:
Activity Spreadsheet -- Enzyme Inhibition Constant Data from BindingDB
Found 1 hit for monomerid = 13511
LigandPNGBDBM13511(Isothiazolidinone (IZD) deriv. 47 | N-[(1S)-1-(1H-...)
Affinity DataIC50:  120nM. Assay description: The activity of PTP1B enzyme was assayed with 4-nitrophenyl phosphate (pNPP) as substrate. Rate of formation of the phenolate ion was monitored at 41...
In DepthDetails ArticlePubMed