BDBM135582 US8846654, 111
SMILES COc1ccc(Cn2c(=O)n(C3CCN(CC3)C=O)c3ccc(OC(F)F)cc3c2=O)cc1OC
InChI Key InChIKey=XIORQKSWYPDOAR-UHFFFAOYSA-N
Data  1 IC50
  Tab Delimited (TSV)   2D SDfile   Computed 3D by Vconf -m prep SDfile
Find this compound or compounds like it in BindingDB:
Activity Spreadsheet -- Enzyme Inhibition Constant Data from BindingDB
Found 1 hit for monomerid = 135582
TargetHigh affinity cAMP-specific 3',5'-cyclic phosphodiesterase 7A(Homo sapiens (Human))
Sanofi
US Patent
LigandPNGBDBM135582(US8846654, 111)
Affinity DataIC50:  6.70nMpH: 7.5Assay Description:The assay is carried out in 1.5 ml Eppendorf tubes comprising 40 mM of Tris-HCl (pH 7.5), 15 mM of MgCl2, 1 mM of EGTA, 0.5 mg/ml of bovine serum alb...
In DepthDetails US Patent