BDBM135755 US10179804, Example 140::US10632171, Peptide No. 140::US8846601, 140::US9458201, 140
SMILES NCC[C@@H]1NC(=O)[C@H](CC(=O)NCCCC[C@H](NC(=O)[C@H](Cc2c[nH]c3ccccc23)NC(=O)[C@H](CCCNC(N)=N)NC(=O)[C@@H](Cc2ccccc2)NC1=O)C(N)=O)NC(=O)[C@H](CCCNC(N)=N)NC(=O)Cc1ccccc1
InChI Key
Data  4 KI
  Tab Delimited (TSV)   2D SDfile   Computed 3D by Vconf -m prep SDfile
Find this compound or compounds like it in BindingDB:
Activity Spreadsheet -- Enzyme Inhibition Constant Data from BindingDB
Found 4 hits for monomerid = 135755
TargetMelanocortin receptor 4(Homo sapiens (Human))
Palatin Technologies
US Patent
LigandPNGBDBM135755(US10179804, Example 140 | US10632171, Peptide No. ...)
Affinity DataKi:  2nMpH: 7.5Assay Description:A competitive inhibition binding assay is performed using membrane homogenates prepared from HEK-293 cells that express recombinant hMC4-R, hMC3-R, o...
In DepthDetails US Patent
TargetMelanocortin receptor 4(Homo sapiens (Human))
Palatin Technologies
US Patent
LigandPNGBDBM135755(US10179804, Example 140 | US10632171, Peptide No. ...)
Affinity DataKi:  2nM. Assay description: A competitive inhibition binding assay is performed using membrane homogenates prepared from HEK-293 cells that express recombinant hMC4-R, hMC3-R, o...
In DepthDetails US Patent
TargetMelanocortin receptor 4(Homo sapiens (Human))
Palatin Technologies
US Patent
LigandPNGBDBM135755(US10179804, Example 140 | US10632171, Peptide No. ...)
Affinity DataKi:  2nM. Assay description: Accumulation of intracellular cAMP was examined as a measure of the ability of the peptides of the present invention to elicit a functional response ...
In DepthDetails US Patent
TargetMelanocortin receptor 4(Homo sapiens (Human))
Palatin Technologies
US Patent
LigandPNGBDBM135755(US10179804, Example 140 | US10632171, Peptide No. ...)
Affinity DataKi:  2nM ΔG°:  -12.3kcal/molepH: 7.5 T: 2°C. Assay description: A competitive inhibition binding assay is performed using membrane homogenates prepared from HEK-293 cells that express recombinant hMC4-R, hMC3-R, o...
In DepthDetails US Patent