BDBM135833 US8853215, 55
SMILES CC(C)(C)c1ccccc1N1CCN(CC1)C(=O)CCC(=O)NS(C)(=O)=O
InChI Key InChIKey=MQYFHFBBMOWNAD-UHFFFAOYSA-N
Data  1 IC50
  Tab Delimited (TSV)   2D SDfile   Computed 3D by Vconf -m prep SDfile
Find this compound or compounds like it in BindingDB:
Activity Spreadsheet -- Enzyme Inhibition Constant Data from BindingDB
Found 1 hit for monomerid = 135833
TargetRetinol-binding protein 4(Homo sapiens (Human))
Takeda Pharmaceutical
US Patent
LigandPNGBDBM135833(US8853215, 55)
Affinity DataIC50:  64nMpH: 7.5 T: 2°C. Assay description: Streptavidin (20 ul) (10 ug/ml Streptavidin type II (Wako Pure Chemical Industries, Ltd.), 10 mM Tris-HCl (pH 7.5), 10 mM NaCl) was added to a 384 we...
Ligand InfoPC cidPC sid
In DepthDetails US Patent