BDBM13607 3-{[(1S)-1-(pentylcarbamoyl)-2-[4-(sulfooxy)phenyl]ethyl]carbamoyl}propanoic acid::Compound II::sulfotyrosyl tripeptide analog 2
SMILES CCCCCNC(=O)[C@H](Cc1ccc(OS(O)(=O)=O)cc1)NC(=O)CCC(O)=O
InChI Key InChIKey=SIRQOBDEVFOULD-HNNXBMFYSA-N
Data  1 KI
  Tab Delimited (TSV)   2D SDfile   Computed 3D by Vconf -m prep SDfile
Find this compound or compounds like it in BindingDB:
Activity Spreadsheet -- Enzyme Inhibition Constant Data from BindingDB
Found 1 hit for monomerid = 13607
TargetTyrosine-protein phosphatase non-receptor type 1(Rattus norvegicus (rat))
Pharmacia
LigandPNGBDBM13607(3-{[(1S)-1-(pentylcarbamoyl)-2-[4-(sulfooxy)phenyl...)
Affinity DataKi:  3.00E+4nM ΔG°:  -6.10kcal/molepH: 7.2 T: 2°C. Assay description: Hydrolysis of substrate p-nitrophenyl phosphate was monitored on a 96-well microplate reader. Concentrations of PTP1B inhibitors that resulted in 50%...
In DepthDetails ArticlePubMed