BDBM136077 US8853203, 103::US9650377, Example 103
SMILES Cc1cc(sn1)-c1cccc2C3=CC(=NCC(=O)N3CCc12)n1cnc(c1)C1CC1
InChI Key InChIKey=RUFHNMPVLJEQHJ-UHFFFAOYSA-N
Data  4 IC50
  Tab Delimited (TSV)   2D SDfile   Computed 3D by Vconf -m prep SDfile
Find this compound or compounds like it in BindingDB:
Activity Spreadsheet -- Enzyme Inhibition Constant Data from BindingDB
Found 4 hits for monomerid = 136077
TargetMetabotropic glutamate receptor 5(Homo sapiens (Human))
Novartis
US Patent
LigandPNGBDBM136077(US8853203, 103 | US9650377, Example 103)
Affinity DataIC50:  18nM. Assay description: Activity of compounds of the present invention was examined by determination to what extent the glutamate-induced elevation of the intracellular calc...
In DepthDetails US Patent
TargetMetabotropic glutamate receptor 1(Homo sapiens (Human))
Novartis
US Patent
LigandPNGBDBM136077(US8853203, 103 | US9650377, Example 103)
Affinity DataIC50: >1.00E+4nM. Assay description: Activity of compounds of the present invention was examined by determination to what extent the glutamate-induced elevation of the intracellular calc...
In DepthDetails US Patent
TargetMetabotropic glutamate receptor 5(Homo sapiens (Human))
Novartis
US Patent
LigandPNGBDBM136077(US8853203, 103 | US9650377, Example 103)
Affinity DataIC50:  18nM. Assay description: Activity of compounds of the present invention with respect to mGluR1 antagonism was examined by an assay based on measurements of L-glutamate induce...
In DepthDetails US Patent
TargetMetabotropic glutamate receptor 1(Homo sapiens (Human))
Novartis
US Patent
LigandPNGBDBM136077(US8853203, 103 | US9650377, Example 103)
Affinity DataIC50: >1.00E+4nM. Assay description: Activity of compounds of the present invention was examined by determination to what extent the glutamate-induced elevation of the intracellular calc...
In DepthDetails US Patent