BDBM136132 US8853203, 96-2::US9650377, Example 96-2
SMILES COCc1cn(cn1)C1=NCC(=O)N2CCc3c(ccc(F)c3C3CC3)C2=C1
InChI Key InChIKey=KHTQVNOASPZXBZ-UHFFFAOYSA-N
Data  4 IC50
  Tab Delimited (TSV)   2D SDfile   Computed 3D by Vconf -m prep SDfile
Find this compound or compounds like it in BindingDB:
Activity Spreadsheet -- Enzyme Inhibition Constant Data from BindingDB
Found 4 hits for monomerid = 136132
TargetMetabotropic glutamate receptor 5(Homo sapiens (Human))
Novartis
US Patent
LigandPNGBDBM136132(US8853203, 96-2 | US9650377, Example 96-2)
Affinity DataIC50:  2nM. Assay description: Activity of compounds of the present invention was examined by determination to what extent the glutamate-induced elevation of the intracellular calc...
In DepthDetails US Patent
TargetMetabotropic glutamate receptor 1(Homo sapiens (Human))
Novartis
US Patent
LigandPNGBDBM136132(US8853203, 96-2 | US9650377, Example 96-2)
Affinity DataIC50:  289nM. Assay description: Activity of compounds of the present invention was examined by determination to what extent the glutamate-induced elevation of the intracellular calc...
In DepthDetails US Patent
TargetMetabotropic glutamate receptor 5(Homo sapiens (Human))
Novartis
US Patent
LigandPNGBDBM136132(US8853203, 96-2 | US9650377, Example 96-2)
Affinity DataIC50:  2nM. Assay description: Activity of compounds of the present invention with respect to mGluR1 antagonism was examined by an assay based on measurements of L-glutamate induce...
In DepthDetails US Patent
TargetMetabotropic glutamate receptor 1(Homo sapiens (Human))
Novartis
US Patent
LigandPNGBDBM136132(US8853203, 96-2 | US9650377, Example 96-2)
Affinity DataIC50:  289nM. Assay description: Activity of compounds of the present invention was examined by determination to what extent the glutamate-induced elevation of the intracellular calc...
In DepthDetails US Patent