BDBM136217 US8853193, 31-3::US8853193, 61
SMILES CCNC(=O)C(C)Oc1cc(F)ccc1Nc1ncnc2sc(C(=O)OC)c(C)c12
InChI Key InChIKey=RSPWNVADGRXFSO-UHFFFAOYSA-N
Data  2 IC50
  Tab Delimited (TSV)   2D SDfile   Computed 3D by Vconf -m prep SDfile
Find this compound or compounds like it in BindingDB:
Activity Spreadsheet -- Enzyme Inhibition Constant Data from BindingDB
Found 2 hits for monomerid = 136217
TargetMAP kinase-interacting serine/threonine-protein kinase 2(Homo sapiens (Human))
Boehringer Ingelheim International
US Patent
LigandPNGBDBM136217(US8853193, 31-3 | US8853193, 61)
Affinity DataIC50:  77nMpH: 7.4 T: 2°C. Assay description: Inhibition of kinase activity of Mnk1 and Mnk2a was assessed with the same assay system, using pre-activated GST-Mnk1 or GST-Mnk2a, respectively. The...
In DepthDetails US Patent
TargetMAP kinase-interacting serine/threonine-protein kinase 2(Homo sapiens (Human))
Boehringer Ingelheim International
US Patent
LigandPNGBDBM136217(US8853193, 31-3 | US8853193, 61)
Affinity DataIC50:  77nMpH: 7.4 T: 2°C. Assay description: Inhibition of kinase activity of Mnk1 and Mnk2a was assessed with the same assay system, using pre-activated GST-Mnk1 or GST-Mnk2a, respectively. The...
In DepthDetails US Patent