BDBM136313 US8853224, 19
SMILES CSC[C@H](O)[C@@H](O)CNCc1c[nH]c2c1nc[nH]c2=O
InChI Key InChIKey=ANFGJKWKGAPTFC-IUCAKERBSA-N
Data  2 Kd
  Tab Delimited (TSV)   2D SDfile   Computed 3D by Vconf -m prep SDfile
Find this compound or compounds like it in BindingDB:
Activity Spreadsheet -- Enzyme Inhibition Constant Data from BindingDB
Found 2 hits for monomerid = 136313
TargetPurine nucleoside phosphorylase(Plasmodium falciparum)
Industrial Research
US Patent
LigandPNGBDBM136313(US8853224, 19)
Affinity DataKd:  5.30E+3nMT: 2°C. Assay description: The inhibitor dissociation constants reported in Table 1 below are for phosphorolysis of inosine by PNP and were based on reaction rates measurements...
In DepthDetails US Patent
TargetPurine nucleoside phosphorylase(Homo sapiens (Human))
Industrial Research
US Patent
LigandPNGBDBM136313(US8853224, 19)
Affinity DataKd:  51nMT: 2°C. Assay description: The inhibitor dissociation constants reported in Table 1 below are for phosphorolysis of inosine by PNP and were based on reaction rates measurements...
In DepthDetails US Patent