BDBM136465 US8865726, 96
SMILES Fc1ccc(cc1Cl)[C@H]1COC(=O)N1c1ccn2ncc(-c3ccc(-c4nc[nH]n4)c(F)c3)c2n1
InChI Key
Data  1 IC50
  Tab Delimited (TSV)   2D SDfile   Computed 3D by Vconf -m prep SDfile
Find this compound or compounds like it in BindingDB:
Activity Spreadsheet -- Enzyme Inhibition Constant Data from BindingDB
Found 1 hit for monomerid = 136465
TargetSerine/threonine-protein kinase mTOR(Homo sapiens (Human))
Array Biopharma
US Patent
LigandPNGBDBM136465(US8865726, 96)
Affinity DataIC50:  0.510nMpH: 7.5 T: 2°C. Assay description: The ability of compounds of Formula I to inhibit mTOR was determined in a radioactive filtration assay that measures the transfer of radiolabeled pho...
In DepthDetails US Patent