BDBM136667 US10005783, 84::US10047097, 84::US10774085, Example 84::US11267818, Example 84::US8865698, 84::US9676783, 84
SMILES O[C@H]1CCN(C1)C(=O)Nc1cnn2ccc(nc12)N1CCC[C@@H]1c1cc(F)ccc1C(F)(F)F
InChI Key InChIKey=LUIHHEKOUMPZBZ-KBXCAEBGSA-N
Data  6 IC50
  Tab Delimited (TSV)   2D SDfile   Computed 3D by Vconf -m prep SDfile
Find this compound or compounds like it in BindingDB:
Activity Spreadsheet -- Enzyme Inhibition Constant Data from BindingDB
Found 6 hits for monomerid = 136667
TargetHigh affinity nerve growth factor receptor(Homo sapiens (Human))
Array Biopharma
US Patent
LigandPNGBDBM136667(US10005783, 84 | US10047097, 84 | US10774085, Exam...)
Affinity DataIC50:  3.20nMpH: 7.5Assay Description:An enzyme-linked immunosorbant assay (ELISA) was used to assess TrkA kinase activity in the presence of inhibitors. Immulon 4HBX 384-well microtiter ...
In DepthDetails US Patent
TargetHigh affinity nerve growth factor receptor(Homo sapiens (Human))
Array Biopharma
US Patent
LigandPNGBDBM136667(US10005783, 84 | US10047097, 84 | US10774085, Exam...)
Affinity DataIC50:  3.20nMpH: 7.5Assay Description:An enzyme-linked immunosorbant assay (ELISA) was used to assess TrkA kinase activity in the presence of inhibitors. Immulon 4HBX 384-well microtiter ...
In DepthDetails US Patent
TargetHigh affinity nerve growth factor receptor(Homo sapiens (Human))
Array Biopharma
US Patent
LigandPNGBDBM136667(US10005783, 84 | US10047097, 84 | US10774085, Exam...)
Affinity DataIC50:  3.20nM. Assay description: An enzyme-linked immunosorbant assay (ELISA) was used to assess TrkA kinase activity in the presence of inhibitors. Immulon 4HBX 384-well microtiter ...
In DepthDetails US Patent
TargetHigh affinity nerve growth factor receptor(Homo sapiens (Human))
Array Biopharma
US Patent
LigandPNGBDBM136667(US10005783, 84 | US10047097, 84 | US10774085, Exam...)
Affinity DataIC50:  3.20nM. Assay description: Trk enzymatic selectivity was assessed using Omnia Kinase Assay reagents from Invitrogen Corp. Enzyme (either TrkA or TrkB from Invitrogen Corp.) and...
In DepthDetails US Patent
TargetHigh affinity nerve growth factor receptor(Homo sapiens (Human))
Array Biopharma
US Patent
LigandPNGBDBM136667(US10005783, 84 | US10047097, 84 | US10774085, Exam...)
Affinity DataIC50:  3.20nM. Assay description: An enzyme-linked immunosorbant assay (ELISA) was used to assess TrkA kinase activity in the presence of inhibitors. Immulon 4HBX 384-well microtiter ...
In DepthDetails US Patent
TargetHigh affinity nerve growth factor receptor [441-796](Homo sapiens (Human))
Array Biopharma
US Patent
LigandPNGBDBM136667(US10005783, 84 | US10047097, 84 | US10774085, Exam...)
Affinity DataIC50:  3.20nMpH: 7.5Assay Description:Immulon 4HBX 384-well microtiter plates (Thermo part #8755) were coated with a 0.025 mg/mL solution of poly (Glu, Ala, Tyr; 6:3:1; Sigma P3899). Vari...
In DepthDetails US Patent