BDBM137832 US8871934, 425
SMILES CN(CCOc1cc2c(-c3ccccc3C2(O)C(F)(F)F)c(c1)-c1cnn(C)c1)C(=O)CO
InChI Key InChIKey=MACXCXRQYARVHH-UHFFFAOYSA-N
Data  1 IC50
  Tab Delimited (TSV)   2D SDfile   Computed 3D by Vconf -m prep SDfile
Find this compound or compounds like it in BindingDB:
Activity Spreadsheet -- Enzyme Inhibition Constant Data from BindingDB
Found 1 hit for monomerid = 137832
LigandPNGBDBM137832(US8871934, 425)
Affinity DataIC50:  21nMpH: 8.0 T: 2°C. Assay description: The inhibitory action of PDHK activity was indirectly evaluated by performing a kinase reaction in the presence of a test compound and measuring the ...
In DepthDetails US Patent