BDBM13787 2-(3-{5-amino-1H-pyrrolo[3,2-b]pyridin-2-yl}-4-hydroxy-5-(3-{[(pyridin-3-ylcarbamoyl)amino]methyl}phenyl)phenyl)acetic acid::5-aminopyrrolo[3,2-b]pyridine 11
SMILES Nc1ccc2[nH]c(cc2n1)-c1cc(CC(O)=O)cc(c1O)-c1cccc(CNC(=O)Nc2cccnc2)c1
InChI Key InChIKey=YCTVFDXRCVUNIW-UHFFFAOYSA-N
Data  1 KI
  Tab Delimited (TSV)   2D SDfile   Computed 3D by Vconf -m prep SDfile
Find this compound or compounds like it in BindingDB:
Activity Spreadsheet -- Enzyme Inhibition Constant Data from BindingDB
Found 1 hit for monomerid = 13787
TargetCoagulation factor VII(Homo sapiens (Human))
Celera
LigandPNGBDBM13787(2-(3-{5-amino-1H-pyrrolo[3,2-b]pyridin-2-yl}-4-hyd...)
Affinity DataKi:  62nM ΔG°:  -9.73kcal/molepH: 7.4 T: 2°C. Assay description: The enzyme reactions were initiated by the addition of substrate, and the color developed from the release of p-nitroanilide from each chromogenic su...
In DepthDetails ArticlePubMed