BDBM137947 US8871934, 540
SMILES Cn1cc(cn1)-c1cc(OCCC23CC4CC(CC(O)(C4)C2)C3)cc2c1-c1ccccc1C2(O)C(F)(F)F
InChI Key InChIKey=OXGPXHYRGGJDKF-UHFFFAOYSA-N
Data  1 IC50
  Tab Delimited (TSV)   2D SDfile   Computed 3D by Vconf -m prep SDfile
Find this compound or compounds like it in BindingDB:
Activity Spreadsheet -- Enzyme Inhibition Constant Data from BindingDB
Found 1 hit for monomerid = 137947
LigandPNGBDBM137947(US8871934, 540)
Affinity DataIC50:  16nMpH: 8.0 T: 2°C. Assay description: The inhibitory action of PDHK activity was indirectly evaluated by performing a kinase reaction in the presence of a test compound and measuring the ...
In DepthDetails US Patent