BDBM137973 US8871934, 566
SMILES OC[C@H](O)Cn1cc(cn1)-c1cc(F)cc2c1-c1ccccc1C2(O)C(F)(F)F
InChI Key InChIKey=CDXNQTYNYOUDIM-BSOCMFCZSA-N
Data  1 IC50
  Tab Delimited (TSV)   2D SDfile   Computed 3D by Vconf -m prep SDfile
Find this compound or compounds like it in BindingDB:
Activity Spreadsheet -- Enzyme Inhibition Constant Data from BindingDB
Found 1 hit for monomerid = 137973
LigandPNGBDBM137973(US8871934, 566)
Affinity DataIC50:  21nMpH: 8.0 T: 2°C. Assay description: The inhibitory action of PDHK activity was indirectly evaluated by performing a kinase reaction in the presence of a test compound and measuring the ...
In DepthDetails US Patent