BDBM138127 US8871783, 13
SMILES CN1C(=O)Cc2ccc(cc12)-c1csc(CC(NC(=O)[C@H]2N[C@@H]3CC[C@H]2C3)C#N)c1F
InChI Key InChIKey=XFADBMAHLDAHBC-AUNCGFEGSA-N
Data  1 KI
  Tab Delimited (TSV)   2D SDfile   Computed 3D by Vconf -m prep SDfile
Find this compound or compounds like it in BindingDB:
Activity Spreadsheet -- Enzyme Inhibition Constant Data from BindingDB
Found 1 hit for monomerid = 138127
TargetDipeptidyl peptidase 1(Homo sapiens (Human))
Boehringer Ingelheim International
US Patent
LigandPNGBDBM138127(US8871783, 13)
Affinity DataKi:  61.7nM ΔG°:  -9.83kcal/molepH: 6.0 T: 2°C. Assay description: The following buffers were used: MES buffer: 25 mM MES, 50 mM NaCl, 5 mM DTT, adjusted to pH 6.0, containing 0.1% BSA; TAGZyme Buffer: 20 mM NaH2PO4,...
In DepthDetails US Patent