BDBM138232 US8871738, 15
SMILES FC(F)(F)c1ccc(c(c1)[C@@H]1CC[C@H]2[C@H](OC(=O)N12)c1cc(cc(c1)C(F)(F)F)C(F)(F)F)-c1ccccc1Cl
InChI Key InChIKey=KJOYXWZTANBIIP-RJGXRXQPSA-N
Data  1 IC50
  Tab Delimited (TSV)   2D SDfile   Computed 3D by Vconf -m prep SDfile
Find this compound or compounds like it in BindingDB:
Activity Spreadsheet -- Enzyme Inhibition Constant Data from BindingDB
Found 1 hit for monomerid = 138232
TargetCholesteryl ester transfer protein(Homo sapiens (Human))
Merck Sharp & Dohme
US Patent
LigandPNGBDBM138232(US8871738, 15)
Affinity DataIC50:  453nMpH: 7.4 T: 2°C. Assay description: First, low density lipoprotein (LDL) (Meridian) was biotinylated by incubating LDL with biotin for 1 hour on ice, after which it was dialyzed to remo...
In DepthDetails US Patent