BDBM138241 US8871738, 24
SMILES Cc1cscc1-c1ccc(cc1[C@@H]1CC[C@H]2[C@H](OC(=O)N12)c1cc(cc(c1)C(F)(F)F)C(F)(F)F)C(F)(F)F
InChI Key InChIKey=YKTBXPOQRMXCDJ-FDFHNCONSA-N
Data  1 IC50
  Tab Delimited (TSV)   2D SDfile   Computed 3D by Vconf -m prep SDfile
Find this compound or compounds like it in BindingDB:
Activity Spreadsheet -- Enzyme Inhibition Constant Data from BindingDB
Found 1 hit for monomerid = 138241
TargetCholesteryl ester transfer protein(Homo sapiens (Human))
Merck Sharp & Dohme
US Patent
LigandPNGBDBM138241(US8871738, 24)
Affinity DataIC50:  122nMpH: 7.4 T: 2°C. Assay description: First, low density lipoprotein (LDL) (Meridian) was biotinylated by incubating LDL with biotin for 1 hour on ice, after which it was dialyzed to remo...
In DepthDetails US Patent