BDBM13843 1-[(3-carbamimidoylphenyl)methyl]-N-[2-(3-chlorophenyl)ethyl]-4-hydroxy-1H-indole-2-carboxamide::3-amidinobenzylindole carboxamide 27::CHEMBL310717
SMILES NC(=N)c1cccc(Cn2c(cc3c(O)cccc23)C(=O)NCCc2cccc(Cl)c2)c1
InChI Key InChIKey=DLPDPMIATLUAQK-UHFFFAOYSA-N
Data  2 KI
  Tab Delimited (TSV)   2D SDfile   Computed 3D by Vconf -m prep SDfile
Find this compound or compounds like it in BindingDB:
Activity Spreadsheet -- Enzyme Inhibition Constant Data from BindingDB
Found 2 hits for monomerid = 13843
TargetCoagulation factor X(Homo sapiens (Human))
Aventis Pharma
Curated by ChEMBL
LigandPNGBDBM13843(1-[(3-carbamimidoylphenyl)methyl]-N-[2-(3-chloroph...)
Affinity DataKi:  707nM. Assay description: Inhibitory activity against serine protease factor Xa (fXa) was determined
In DepthDetails ArticlePubMed
TargetCoagulation factor X(Homo sapiens (Human))
Aventis Pharma
Curated by ChEMBL
LigandPNGBDBM13843(1-[(3-carbamimidoylphenyl)methyl]-N-[2-(3-chloroph...)
Affinity DataKi:  707nM. Assay description: The inhibitory effect of test compound for human fXa was determined by using the chromogenic substrates S-2765. The hydrolysis rates of chromogenic s...
In DepthDetails ArticlePubMed