BDBM139077 US8883771, 23
SMILES CN[C@@H](C)C(=O)N[C@H]1CN(CC[C@H]2CCC(N2C1=O)C(=O)NC(c1ccccc1)c1ccccc1)C(=O)Oc1ccc(cc1)C(C)(C)c1ccc(OC(=O)N2CC[C@H]3CC[C@H](N3C(=O)[C@H](C2)NC(=O)[C@H](C)NC)C(=O)NC(c2ccccc2)c2ccccc2)cc1
InChI Key InChIKey=IMVQXBGPYVZFSC-KJASOUKJSA-N
Data  3 IC50
  Tab Delimited (TSV)   2D SDfile   Computed 3D by Vconf -m prep SDfile
Find this compound or compounds like it in BindingDB:
Activity Spreadsheet -- Enzyme Inhibition Constant Data from BindingDB
Found 3 hits for monomerid = 139077
TargetE3 ubiquitin-protein ligase XIAP(Homo sapiens (Human))
The Regents Of The University Of Michigan
US Patent
LigandPNGBDBM139077(US8883771, 23)
Affinity DataIC50: <30nMpH: 7.5Assay Description:Binding affinities of the present compounds to XIAP linker-BIR2-BIR3 (residues 120-356), cIAP1-BIR3 (residues 253-363), and cIAP-2 BIR3 (residues 238...
Ligand InfoPC cidPC sid
In DepthDetails US Patent
TargetBaculoviral IAP repeat-containing protein 3(Homo sapiens (Human))
The Regents Of The University Of Michigan
US Patent
LigandPNGBDBM139077(US8883771, 23)
Affinity DataIC50: <300nMpH: 7.5Assay Description:Binding affinities of the present compounds to XIAP linker-BIR2-BIR3 (residues 120-356), cIAP1-BIR3 (residues 253-363), and cIAP-2 BIR3 (residues 238...
Ligand InfoPC cidPC sid
In DepthDetails US Patent
TargetBaculoviral IAP repeat-containing protein 2(Homo sapiens (Human))
The Regents Of The University Of Michigan
US Patent
LigandPNGBDBM139077(US8883771, 23)
Affinity DataIC50: <300nMpH: 7.5Assay Description:Binding affinities of the present compounds to XIAP linker-BIR2-BIR3 (residues 120-356), cIAP1-BIR3 (residues 253-363), and cIAP-2 BIR3 (residues 238...
Ligand InfoPC cidPC sid
In DepthDetails US Patent