BDBM13914 4-[(1-benzyl-1H-indazol-5-yl)amino]-5-ethyl-N,N-dimethylpyrrolo[1,2-a][1,2,4]triazine-6-carboxamide::CHEMBL372293::pyrrolo[2,1-f][1,2,4]triazine analog 7c
SMILES CCc1c(cn2ncnc(Nc3ccc4n(Cc5ccccc5)ncc4c3)c12)C(=O)N(C)C
InChI Key InChIKey=FAFIJKWOYIPTEN-UHFFFAOYSA-N
Data  4 IC50
  Tab Delimited (TSV)   2D SDfile   Computed 3D by Vconf -m prep SDfile
Find this compound or compounds like it in BindingDB:
Activity Spreadsheet -- Enzyme Inhibition Constant Data from BindingDB
Found 4 hits for monomerid = 13914
TargetReceptor tyrosine-protein kinase erbB-2(Homo sapiens (Human))
Bristol-Myers Squibb Pharmaceutical Research Institute
Curated by ChEMBL
LigandPNGBDBM13914(4-[(1-benzyl-1H-indazol-5-yl)amino]-5-ethyl-N,N-di...)
Affinity DataIC50:  500nM. Assay description: The kinase activity was determined by using recombinant enzyme incubating with its substrate in the presence of test compound and ATP/[gamma-33P] ATP...
In DepthDetails ArticlePubMed
TargetEpidermal growth factor receptor(Homo sapiens (Human))
Bristol-Myers Squibb Pharmaceutical Research Institute
Curated by ChEMBL
LigandPNGBDBM13914(4-[(1-benzyl-1H-indazol-5-yl)amino]-5-ethyl-N,N-di...)
Affinity DataIC50:  200nM. Assay description: In vitro inhibitory concentration against EGFR cytoplasmic sequence expressed in Sf9 cells
In DepthDetails ArticlePubMed
TargetReceptor tyrosine-protein kinase erbB-2(Homo sapiens (Human))
Bristol-Myers Squibb Pharmaceutical Research Institute
Curated by ChEMBL
LigandPNGBDBM13914(4-[(1-benzyl-1H-indazol-5-yl)amino]-5-ethyl-N,N-di...)
Affinity DataIC50:  500nM. Assay description: In vitro inhibitory concentration against HER2 cytoplasmic sequence expressed in Sf9 cells
In DepthDetails ArticlePubMed
TargetEpidermal growth factor receptor(Homo sapiens (Human))
Bristol-Myers Squibb Pharmaceutical Research Institute
Curated by ChEMBL
LigandPNGBDBM13914(4-[(1-benzyl-1H-indazol-5-yl)amino]-5-ethyl-N,N-di...)
Affinity DataIC50:  200nM. Assay description: The kinase activity was determined by using recombinant enzyme incubating with its substrate in the presence of test compound and ATP/[gamma-33P] ATP...
In DepthDetails ArticlePubMed