BDBM13932 Macrocyclic Peptidomimetic Inhibitor 6::tert-butyl N-[(2S,3R)-4-{[(8S,11S)-8-[(2S)-butan-2-yl]-7,10-dioxo-2-oxa-6,9-diazabicyclo[11.2.2]heptadeca-1(15),13,16-trien-11-yl]amino}-3-hydroxy-1-phenylbutan-2-yl]carbamate
SMILES CCC(C)[C@@H]1NC(=O)[C@H](Cc2ccc(OCCCNC1=O)cc2)NC[C@@H](O)[C@H](Cc1ccccc1)NC(=O)OC(C)(C)C
InChI Key InChIKey=RFUKEYSMPSCDLJ-NZRZFYOGSA-N
Data  1 KI
PDB links: 2 PDB IDs match this monomer.
  Tab Delimited (TSV)   2D SDfile   Computed 3D by Vconf -m prep SDfile
Find this compound or compounds like it in BindingDB:
Activity Spreadsheet -- Enzyme Inhibition Constant Data from BindingDB
Found 1 hit for monomerid = 13932
TargetDimer of Gag-Pol polyprotein [501-599,Q508K,L534I,L564I,C568A,C596A](Human immunodeficiency virus type 1)
University Of Queensland
LigandPNGBDBM13932(Macrocyclic Peptidomimetic Inhibitor 6 | tert-buty...)
Affinity DataKi:  4nM ΔG°:  -11.9kcal/molepH: 6.5 T: 2°C. Assay description: he Ki values were determined using fluorogenic substrate, 2-(aminobenzoyl)-Thr-Ile-Nle-Phe(p-NO2)-Gln-ArgNH2. A standard curve relating changes in fl...