BDBM139447 US8889671, 61::US8889671, 63
SMILES C[C@@H]1CN2C([C@H](C)O1)C1(Cc3cc4c(noc4c(F)c23)N2[C@@H](COC2=O)c2ncccn2)C(=O)NC(=O)NC1=O
InChI Key InChIKey=XNHIBFIYRMMRCU-KISLSHQNSA-N
Data  2 IC50
  Tab Delimited (TSV)   2D SDfile   Computed 3D by Vconf -m prep SDfile
Find this compound or compounds like it in BindingDB:
Activity Spreadsheet -- Enzyme Inhibition Constant Data from BindingDB
Found 2 hits for monomerid = 139447
TargetDNA gyrase subunit A(Escherichia coli (strain K12))
Astrazeneca
US Patent
LigandPNGBDBM139447(US8889671, 61 | US8889671, 63)
Affinity DataIC50:  380nMpH: 7.5Assay Description:In a black, 384-well polystyrene assay plate, 30 microliters/well of 5 nM Escherichia coli DNA gyrase A/B tetramer and 130 micrograms/mL of topologic...
In DepthDetails US Patent
TargetDNA gyrase subunit A(Escherichia coli (strain K12))
Astrazeneca
US Patent
LigandPNGBDBM139447(US8889671, 61 | US8889671, 63)
Affinity DataIC50:  340nMpH: 7.5Assay Description:In a black, 384-well polystyrene assay plate, 30 microliters/well of 5 nM Escherichia coli DNA gyrase A/B tetramer and 130 micrograms/mL of topologic...
In DepthDetails US Patent