BDBM139565 US8889870, 25::US9388176, 25::US9820989, 25
SMILES CC(C)c1cccc(NC(=O)c2cc(ccn2)N2CCc3nc(N)ncc3C2)c1
InChI Key InChIKey=SAXNLRSYOCEWCI-UHFFFAOYSA-N
Data  1 KI  2 IC50
  Tab Delimited (TSV)   2D SDfile   Computed 3D by Vconf -m prep SDfile
Find this compound or compounds like it in BindingDB:
Activity Spreadsheet -- Enzyme Inhibition Constant Data from BindingDB
Found 3 hits for monomerid = 139565
TargetVascular endothelial growth factor receptor 2(Homo sapiens (Human))
Allergan
US Patent
LigandPNGBDBM139565(US8889870, 25 | US9388176, 25 | US9820989, 25)
Affinity DataKi: >1.00E+4nM. Assay description: Biochemical KDR kinase assays were performed in 96 well microliter plates that were coated overnight with 75 μg/well of poly-Glu-Tyr (4:1) in 10...
In DepthDetails US Patent
TargetVascular endothelial growth factor receptor 2(Homo sapiens (Human))
Allergan
US Patent
LigandPNGBDBM139565(US8889870, 25 | US9388176, 25 | US9820989, 25)
Affinity DataIC50: >1.00E+4nMpH: 7.4Assay Description:Biochemical KDR kinase assays were performed in 96 well microliter plates that were coated overnight with 75 .mu.g/well of poly-Glu-Tyr (4:1) in 10 m...
In DepthDetails US Patent
TargetVascular endothelial growth factor receptor 2(Homo sapiens (Human))
Allergan
US Patent
LigandPNGBDBM139565(US8889870, 25 | US9388176, 25 | US9820989, 25)
Affinity DataIC50: >1.00E+4nMpH: 7.4 T: 2°C. Assay description: Biochemical KDR kinase assays were performed in 96 well microliter plates that were coated overnight with 75 μg/well of poly-Glu-Tyr (4:1) in 10 m...
In DepthDetails US Patent