BDBM139680 US8894989, 62
SMILES COc1ccc(cc1)S(=O)(=O)N1CCCN(Cc2nc3cccc4c3c(n[nH]c4=O)[nH]2)CC1
InChI Key InChIKey=IFAJMHIPVBMFOF-UHFFFAOYSA-N
Data  1 IC50
  Tab Delimited (TSV)   2D SDfile   Computed 3D by Vconf -m prep SDfile
Find this compound or compounds like it in BindingDB:
Activity Spreadsheet -- Enzyme Inhibition Constant Data from BindingDB
Found 1 hit for monomerid = 139680
TargetPoly [ADP-ribose] polymerase 1(Homo sapiens (Human))
Eisai
US Patent
LigandPNGBDBM139680(US8894989, 62)
Affinity DataIC50:  22nMpH: 8.0Assay Description:A convenient method to determine IC50 of a PARP inhibitor compound is a PARP assay using purified recombinant human PARP from Trevigan (Gaithersburg,...
In DepthDetails US Patent