BDBM13997 5-{3-[(1E)-3-[3-hydroxy-2-(methoxycarbonyl)phenoxy]prop-1-en-1-yl]phenyl}-4-(hydroxymethyl)-1,2-oxazole-3-carboxylic acid::Isoxazole carboxylic acid analog 8
SMILES COC(=O)c1c(O)cccc1OC\C=C\c1cccc(c1)-c1onc(C(O)=O)c1CO
InChI Key InChIKey=DQSRCEFDWMQCCV-GQCTYLIASA-N
Data  2 KI  2 IC50
PDB links: 1 PDB ID matches this monomer.
  Tab Delimited (TSV)   2D SDfile   Computed 3D by Vconf -m prep SDfile
Find this compound or compounds like it in BindingDB:
Activity Spreadsheet -- Enzyme Inhibition Constant Data from BindingDB
Found 5 hits for monomerid = 13997
LigandPNGBDBM13997(5-{3-[(1E)-3-[3-hydroxy-2-(methoxycarbonyl)phenoxy...)
Affinity DataKi:  0.920nM
In DepthDetails MMDB
PDB3D3D Structure (crystal)
TargetTyrosine-protein phosphatase non-receptor type 1 [1-298](Homo sapiens (Human))
Abbott Laboratories
LigandPNGBDBM13997(5-{3-[(1E)-3-[3-hydroxy-2-(methoxycarbonyl)phenoxy...)
Affinity DataKi:  920nM ΔG°:  -8.15kcal/molepH: 7.5 T: 2°C. Assay description: The phosphatase activity resulted in the formation of the colored product p-nitrophenol, which was continuously monitored at 405 nm every 30 s for 15...
TargetTyrosine-protein phosphatase non-receptor type 2(Homo sapiens (Human))
Abbott Laboratories
LigandPNGBDBM13997(5-{3-[(1E)-3-[3-hydroxy-2-(methoxycarbonyl)phenoxy...)
Affinity DataKi:  1.92E+4nM ΔG°:  -6.37kcal/molepH: 7.5 T: 2°C. Assay description: The phosphatase activity resulted in the formation of the colored product p-nitrophenol, which was continuously monitored at 405 nm every 30 s for 15...
In DepthDetails ArticlePubMed
LigandPNGBDBM13997(5-{3-[(1E)-3-[3-hydroxy-2-(methoxycarbonyl)phenoxy...)
Affinity DataIC50:  920nM. Assay description: Inhibition of PTP1B (unknown origin)
TargetTyrosine-protein phosphatase non-receptor type 2(Homo sapiens (Human))
Abbott Laboratories
LigandPNGBDBM13997(5-{3-[(1E)-3-[3-hydroxy-2-(methoxycarbonyl)phenoxy...)
Affinity DataIC50:  1.92E+4nM. Assay description: Inhibition of TCPTP (unknown origin)
In DepthDetails ArticlePubMed