BDBM140037 US8901315, 39
SMILES CN(C)C(=O)c1ccc(NC(=O)c2cc3c(C)nn(C4CCCCC4)c3s2)cc1
InChI Key InChIKey=MTDGXOGHMVHBTP-UHFFFAOYSA-N
Data  2 IC50
  Tab Delimited (TSV)   2D SDfile   Computed 3D by Vconf -m prep SDfile
Find this compound or compounds like it in BindingDB:
Activity Spreadsheet -- Enzyme Inhibition Constant Data from BindingDB
Found 2 hits for monomerid = 140037
TargetPhosphodiesterase(Mus musculus (Mouse))
Daiichi Sankyo
US Patent
LigandPNGBDBM140037(US8901315, 39)
Affinity DataIC50:  3.50E+3nMpH: 6.5 T: 2°C. Assay description: The PDE 4 (phosphodiesterase IV) inhibiting effect of the compounds of the present invention was performed by the following method, which was modifie...
In DepthDetails US Patent
TargetHigh affinity cAMP-specific 3',5'-cyclic phosphodiesterase 7A(Homo sapiens (Human))
Daiichi Sankyo
US Patent
LigandPNGBDBM140037(US8901315, 39)
Affinity DataIC50:  14nMpH: 7.5 T: 2°C. Assay description: The PDE 7 (phosphodiesterase VII) inhibiting effect of the compounds of the present invention was performed by the following method, which was modifi...
In DepthDetails US Patent