BDBM140228 US8906911, 37
SMILES CO[C@@H]1COCC[C@@H]1N[C@@H]1C[C@H]2CCC[C@]2(C1)C(=O)N1C[C@@H]2C[C@H]1CN2c1ccc(cc1C(F)(F)F)C#N
InChI Key InChIKey=PNMMRCPNUFXAKD-BHDKNMHBSA-N
Data  1 IC50
  Tab Delimited (TSV)   2D SDfile   Computed 3D by Vconf -m prep SDfile
Find this compound or compounds like it in BindingDB:
Activity Spreadsheet -- Enzyme Inhibition Constant Data from BindingDB
Found 1 hit for monomerid = 140228
TargetC-C chemokine receptor type 2(Homo sapiens (Human))
Abbvie
US Patent
LigandPNGBDBM140228(US8906911, 37)
Affinity DataIC50:  1.60E+3nMpH: 7.4 T: 2°C. Assay description: Radioligand binding assays were performed in CHO cells expressing human CCR2B and Galpha±16 coupling protein. All compounds were dissolved in DMSO a...
In DepthDetails US Patent