BDBM140264 US8906933, (S)-4-(3-ethoxy-4-hydroxy-5-nitrophenyl)-5-phenyl-6-(pyridin-3-yl)-3,4-dihydropyrimidin-2(1H)-one
SMILES CCOc1cc(cc(c1O)[N+]([O-])=O)[C@@H]1NC(=O)NC(=C1c1ccccc1)c1cccnc1
InChI Key InChIKey=IIDWQHVTAQYFRQ-NRFANRHFSA-N
Data  2 IC50
  Tab Delimited (TSV)   2D SDfile   Computed 3D by Vconf -m prep SDfile
Find this compound or compounds like it in BindingDB:
Activity Spreadsheet -- Enzyme Inhibition Constant Data from BindingDB
Found 2 hits for monomerid = 140264
TargetNeuromedin-K receptor(Homo sapiens (Human))
N30 Pharmaceuticals
US Patent
LigandPNGBDBM140264(US8906933, (S)-4-(3-ethoxy-4-hydroxy-5-nitrophenyl...)
Affinity DataIC50:  5.50E+4nMpH: 7.4 T: 2°C. Assay description: Receptor binding assays were performed using crude membranes prepared from CHO cells expressing human NK3 receptor. Osanetant (SR142801), a non-pepti...
In DepthDetails US Patent
TargetAlcohol dehydrogenase class-3(Homo sapiens (Human))
N30 Pharmaceuticals
US Patent
LigandPNGBDBM140264(US8906933, (S)-4-(3-ethoxy-4-hydroxy-5-nitrophenyl...)
Affinity DataIC50:  28nMpH: 7.4 T: 2°C. Assay description: Receptor binding assays were performed using crude membranes prepared from CHO cells expressing human NK3 receptor. Osanetant (SR142801), a non-pepti...
In DepthDetails US Patent