BDBM140319 US8912173, 45
SMILES NC(=O)c1cccnc1COc1cc(cc2ncccc12)-c1ccc(nc1)N1CCOCC1
InChI Key InChIKey=MWOCTCGPSNQDQB-UHFFFAOYSA-N
Data  1 IC50
  Tab Delimited (TSV)   2D SDfile   Computed 3D by Vconf -m prep SDfile
Find this compound or compounds like it in BindingDB:
Activity Spreadsheet -- Enzyme Inhibition Constant Data from BindingDB
Found 1 hit for monomerid = 140319
TargetTyrosine-protein kinase SYK(Homo sapiens (Human))
Boehringer Ingelheim International
US Patent
LigandPNGBDBM140319(US8912173, 45)
Affinity DataIC50:  1.60nMpH: 7.5 T: 2°C. Assay description: Recombinant human Syk (amino acids 342-635) was expressed as a fusion protein with an N-terminal GST tag, affinity-purified and deep-frozen at a conc...
In DepthDetails US Patent