BDBM140357 US8912173, 82
SMILES Cn1cnc2ccc(cc12)-c1cc(OCc2ncccc2C(N)=O)c2cccnc2c1
InChI Key InChIKey=MTEITOZYPBOPON-UHFFFAOYSA-N
Data  1 IC50
  Tab Delimited (TSV)   2D SDfile   Computed 3D by Vconf -m prep SDfile
Find this compound or compounds like it in BindingDB:
Activity Spreadsheet -- Enzyme Inhibition Constant Data from BindingDB
Found 1 hit for monomerid = 140357
TargetTyrosine-protein kinase SYK(Homo sapiens (Human))
Boehringer Ingelheim International
US Patent
LigandPNGBDBM140357(US8912173, 82)
Affinity DataIC50:  8.10nMpH: 7.5 T: 2°C. Assay description: Recombinant human Syk (amino acids 342-635) was expressed as a fusion protein with an N-terminal GST tag, affinity-purified and deep-frozen at a conc...
In DepthDetails US Patent