BDBM14048 4-(4-fluorophenyl)-N-(1H-indazol-5-yl)-6-methyl-2-oxo-1,2,3,4-tetrahydropyrimidine-5-carboxamide::JMC516631 Compound 1::dihydropyrimidinyl indazole amide 3
SMILES CC1=NC(=O)NC(C1C(=O)Nc1ccc2[nH]ncc2c1)c1ccc(F)cc1
InChI Key InChIKey=ANFRYCSWUISTKS-UHFFFAOYSA-N
Data  2 IC50
  Tab Delimited (TSV)   2D SDfile   Computed 3D by Vconf -m prep SDfile
Find this compound or compounds like it in BindingDB:
Activity Spreadsheet -- Enzyme Inhibition Constant Data from BindingDB
Found 2 hits for monomerid = 14048
TargetRho-associated protein kinase 1(Homo sapiens (Human))
Gsk
LigandPNGBDBM14048(4-(4-fluorophenyl)-N-(1H-indazol-5-yl)-6-methyl-2-...)
Affinity DataIC50:  14nMpH: 7.4 T: 2°C. Assay description: The assay of Rock-1 activity involved incubation with peptide substrate and ATP33, and the incorporation of P33 into the peptide was quantified by Sc...
In DepthDetails ArticlePubMed
TargetRho-associated protein kinase 1(Homo sapiens (Human))
Gsk
LigandPNGBDBM14048(4-(4-fluorophenyl)-N-(1H-indazol-5-yl)-6-methyl-2-...)
Affinity DataIC50:  14nMpH: 7.4 T: 2°C. Assay description: The assay of Rock-1 activity involved incubation with peptide substrate and ATP/[gamma-33P] ATP, the subsequent incorporation of 33P into the peptid...
In DepthDetails ArticlePubMed