BDBM14049 4-(4-Fluorophenyl)-N-1H-indazol-5-yl-2-methyl-6-oxo-1,4,5,6-tetrahydro-3-pyridinecarboxamide::4-(4-fluorophenyl)-N-(1H-indazol-5-yl)-2-methyl-6-oxo-1,4,5,6-tetrahydropyridine-3-carboxamide::dihydropyridone indazole amide 4
SMILES CC1=C(C(CC(=O)N1)c1ccc(F)cc1)C(=O)Nc1ccc2[nH]ncc2c1
InChI Key InChIKey=XLCGNRUTBJTNGH-UHFFFAOYSA-N
Data  1 IC50
  Tab Delimited (TSV)   2D SDfile   Computed 3D by Vconf -m prep SDfile
Find this compound or compounds like it in BindingDB:
Activity Spreadsheet -- Enzyme Inhibition Constant Data from BindingDB
Found 1 hit for monomerid = 14049
TargetRho-associated protein kinase 1(Homo sapiens (Human))
Glaxosmithkline
LigandPNGBDBM14049(4-(4-Fluorophenyl)-N-1H-indazol-5-yl-2-methyl-6-ox...)
Affinity DataIC50:  51nMpH: 7.4 T: 2°C. Assay description: The assay of Rock-1 activity involved incubation with peptide substrate and ATP/[gamma-33P] ATP, the subsequent incorporation of 33P into the peptid...
In DepthDetails ArticlePubMed