BDBM140569 US8912221, 42
SMILES COCC(=O)NC1(COC1)C(=O)N[C@H](C)c1ncc(cc1F)-c1cc(Cl)cc(Cl)c1OCC(F)F
InChI Key InChIKey=ZYTIZDWKWBIHRN-LLVKDONJSA-N
Data  1 KI
  Tab Delimited (TSV)   2D SDfile   Computed 3D by Vconf -m prep SDfile
Find this compound or compounds like it in BindingDB:
Activity Spreadsheet -- Enzyme Inhibition Constant Data from BindingDB
Found 1 hit for monomerid = 140569
TargetB1 bradykinin receptor(Homo sapiens (Human))
Hoffmann-La Roche
US Patent
LigandPNGBDBM140569(US8912221, 42)
Affinity DataKi:  119nMpH: 7.4Assay Description:For binding, Bradykinin-1 receptor antagonist compounds were added in various concentrations in 50 mM Tris pH 7.4, 5 mM MgCl2 together with 6 nM Kall...
In DepthDetails US Patent