BDBM140627 US8912224, 56
SMILES Cc1nccc(CNC(=O)c2cnc(Oc3ccc4OC(CCc4c3)c3cccc(F)c3)s2)n1
InChI Key InChIKey=SVCZKWSFRBCNDE-UHFFFAOYSA-N
Data  1 IC50
  Tab Delimited (TSV)   2D SDfile   Computed 3D by Vconf -m prep SDfile
Find this compound or compounds like it in BindingDB:
Activity Spreadsheet -- Enzyme Inhibition Constant Data from BindingDB
Found 1 hit for monomerid = 140627
TargetSodium/calcium exchanger 1(Homo sapiens (Human))
Sanofi
US Patent
LigandPNGBDBM140627(US8912224, 56)
Affinity DataIC50:  200nM. Assay description: The assay is based on the monitoring of intracellular Ca2+concentrations using the calcium-sensitive dye Fluo-4. CHO cells expressing NCX1 were loade...
In DepthDetails US Patent