BDBM141042 US8653100, 2
SMILES CS(=O)(=O)NCCOc1ccc2CCNC(c2c1)C1(CCC1)c1ccc(Cl)cc1
InChI Key InChIKey=SPFYOJRFXFKILJ-UHFFFAOYSA-N
Data  1 KI  1 IC50
  Tab Delimited (TSV)   2D SDfile   Computed 3D by Vconf -m prep SDfile
Find this compound or compounds like it in BindingDB:
Activity Spreadsheet -- Enzyme Inhibition Constant Data from BindingDB
Found 2 hits for monomerid = 141042
TargetSodium- and chloride-dependent glycine transporter 1(Homo sapiens (Human))
Abbvie
US Patent
LigandPNGBDBM141042(US8653100, 2)
Affinity DataKi: <100nMpH: 7.5Assay Description:Radioligand binding to human GlyT1c transporter-expressing membranes was carried out as described in Mezler et al., Molecular Pharmacology 74:1705-17...
In DepthDetails US Patent
TargetSodium- and chloride-dependent glycine transporter 1(Homo sapiens (Human))
Abbvie
US Patent
LigandPNGBDBM141042(US8653100, 2)
Affinity DataIC50: <100nM. Assay description: [3H]-Glycine uptake into recombinant CHO cells expressing human GlyT1: Human GlyT1c expressing recombinant hGlyT1c_5_CHO cells were plated at 20,000 ...
In DepthDetails US Patent